{"text_format":"1","workbook":"xlsx","n_sheets":3,"sheets":["Levies","Name","Data"],"not_rendered":{"charts":0,"images":0,"macros":1,"external_links":0,"defined_names":2,"comments":0,"pivot_tables":0},"unopened":[],"bounds":{"document_bytes":16777216,"sheet_cells":100000,"rows_first":2000,"rows_last":500,"rows_between":2000,"halvings":0,"cell_chars":16384,"cell_head_chars":4096},"cells_cut":0,"cells_raw":0,"read":"whole","date_system":"1900"}

{"sheet":"Levies","index":0,"n_rows":31,"n_cols":8,"rows_kept":31,"cut":false,"hidden":false,"merged":[[0,2,2,6],[18,2,18,3],[18,4,18,5],[5,6,5,7],[5,2,5,5]]}
[null,null,"FY 2011 School District Outstanding Property Tax Levies and Maximum Levy Limitations"]
[null,"Select School District:"]
[null,null,null,null,null,null,null,{"$f":"NOW()","v":"2010-12-08T09:05:42.680"}]
[null,{"$f":"VLOOKUP(Name!D2,Name!A3:B384,2,FALSE)","v":5463}]
[]
[null,null,"School District Maximums",null,null,null,"Iowa Code"]
[null,null,"Max Total $","Max Total Rate","Max Surtax ","Final Year","Authorized Maximums","Reference"]
[null,"Instructional Support Authority",{"$f":"VLOOKUP(Name!$D$2,Data!$1:$1048576,4,FALSE)","v":0},{"$f":"VLOOKUP(Name!$D$2,Data!$1:$1048576,5,FALSE)","v":0.1},{"$f":"VLOOKUP(Name!$D$2,Data!$1:$1048576,6,FALSE)","v":0.2},{"$f":"VLOOKUP(Name!$D$2,Data!$1:$1048576,7,FALSE)","v":2014},"10% of regular program",257.18]
[null,"Ed Improvement Authority",{"$f":"VLOOKUP(Name!$D$2,Data!$1:$1048576,8,FALSE)","v":0},{"$f":"VLOOKUP(Name!$D$2,Data!$1:$1048576,9,FALSE)","v":0},"na","vote to rescind","max % authorized by electors",257.29000000000002]
[null,"General Fund (Total w/ISL & Ed Imp)",null,null,null,"annual","formula based","Chapter 257"]
[null,"Management",null,null,null,"annual","limited by use of funds","298.4"]
[null,"Amana Library",null,{"$f":"VLOOKUP(Name!$D$2,Data!$1:$1048576,10,FALSE)","v":0},null,"vote to rescind","$.20 property tax limit","298.7"]
[null,"Voted Physical Plant & Equipment",{"$f":"VLOOKUP(Name!$D$2,Data!$1:$1048576,11,FALSE)","v":0},{"$f":"VLOOKUP(Name!$D$2,Data!$1:$1048576,12,FALSE)","v":1.34},"na",{"$f":"VLOOKUP(Name!$D$2,Data!$1:$1048576,13,FALSE)","v":2020},"$1.34 property tax  limit","298.2"]
[null,"Regular Physical Plant & Equipment",null,null,null,"annual","$.33 property tax  limit","298.2"]
[null,"Public Education/Recreation (Playground)",null,{"$f":"VLOOKUP(Name!$D$2,Data!$1:$1048576,14,FALSE)","v":0},null,"vote to rescind","$.135 property tax  limit","300.2"]
[null,"Debt Service",null,{"$f":"VLOOKUP(Name!$D$2,Data!$1:$1048576,15,FALSE)","v":2.7},null,"ballot determined","$2.70/$4.05 property tax  limit","298.18"]
[]
[]
[null,null,"FY 2011 Property Tax",null,"FY 2011 Income Surtax"]
[null,null,"Amount","Rate","Amount","Rate"]
[null,"Instructional Support Authority",{"$f":"VLOOKUP(Name!$D$2,Data!$1:$1048576,18,FALSE)","v":11668},{"$f":"VLOOKUP(Name!$D$2,Data!$1:$1048576,19,FALSE)","v":4.0070000000000001E-2},{"$f":"VLOOKUP(Name!$D$2,Data!$1:$1048576,38,FALSE)","v":525047},{"$f":"VLOOKUP(Name!$D$2,Data!$1:$1048576,39,FALSE)","v":0.11}]
[null,"Ed Improvement Authority",{"$f":"VLOOKUP(Name!$D$2,Data!$1:$1048576,20,FALSE)","v":0},{"$f":"VLOOKUP(Name!$D$2,Data!$1:$1048576,21,FALSE)","v":0},{"$f":"VLOOKUP(Name!$D$2,Data!$1:$1048576,40,FALSE)","v":0},{"$f":"VLOOKUP(Name!$D$2,Data!$1:$1048576,41,FALSE)","v":0}]
[]
[null,"General Fund (Total w/ISL & Ed Imp)",{"$f":"VLOOKUP(Name!$D$2,Data!$1:$1048576,16,FALSE)","v":4641504},{"$f":"VLOOKUP(Name!$D$2,Data!$1:$1048576,17,FALSE)","v":15.94153}]
[null,"Management",{"$f":"VLOOKUP(Name!$D$2,Data!$1:$1048576,22,FALSE)","v":449999},{"$f":"VLOOKUP(Name!$D$2,Data!$1:$1048576,23,FALSE)","v":1.54555}]
[null,"Amana Library",{"$f":"VLOOKUP(Name!$D$2,Data!$1:$1048576,26,FALSE)","v":0},{"$f":"VLOOKUP(Name!$D$2,Data!$1:$1048576,27,FALSE)","v":0}]
[null,"Voted Physical Plant & Equipment",{"$f":"VLOOKUP(Name!$D$2,Data!$1:$1048576,28,FALSE)","v":13703},{"$f":"VLOOKUP(Name!$D$2,Data!$1:$1048576,29,FALSE)","v":4.6420000000000003E-2},{"$f":"VLOOKUP(Name!$D$2,Data!$1:$1048576,42,FALSE)","v":381852},{"$f":"VLOOKUP(Name!$D$2,Data!$1:$1048576,43,FALSE)","v":0.08}]
[null,"Regular Physical Plant & Equipment",{"$f":"VLOOKUP(Name!$D$2,Data!$1:$1048576,30,FALSE)","v":97413},{"$f":"VLOOKUP(Name!$D$2,Data!$1:$1048576,31,FALSE)","v":0.33}]
[null,"Public Education/Recreation (Playground)",{"$f":"VLOOKUP(Name!$D$2,Data!$1:$1048576,32,FALSE)","v":0},{"$f":"VLOOKUP(Name!$D$2,Data!$1:$1048576,33,FALSE)","v":0}]
[null,"Debt Service",{"$f":"VLOOKUP(Name!$D$2,Data!$1:$1048576,34,FALSE)","v":0},{"$f":"VLOOKUP(Name!$D$2,Data!$1:$1048576,35,FALSE)","v":0}]
[null,"Grand Total",{"$f":"VLOOKUP(Name!$D$2,Data!$1:$1048576,36,FALSE)","v":5202619},{"$f":"VLOOKUP(Name!$D$2,Data!$1:$1048576,37,FALSE)","v":17.863499999999998},{"$f":"SUM(E21:E30)","v":906899},{"$f":"SUM(F21:F30)","v":0.19}]

{"sheet":"Name","index":1,"n_rows":384,"n_cols":4,"rows_kept":384,"cut":false,"hidden":true,"merged":[]}
[]
[null,"Dist","School",274]
[1,"0000"]
[2,18,"ADAIR-CASEY"]
[3,27,"ADEL-DESOTO-MINBURN"]
[4,9,"AGWSR"]
[5,441,"A-H-S-T"]
[6,63,"AKRON-WESTFIELD"]
[7,72,"ALBERT CITY-TRUESDALE"]
[8,81,"ALBIA"]
[9,7918,"ALBIA FROM RUSSELL"]
[10,99,"ALBURNETT"]
[11,108,"ALDEN"]
[12,126,"ALGONA"]
[13,135,"ALLAMAKEE"]
[14,153,"ALLISON-BRISTOW"]
[15,171,"ALTA"]
[16,225,"AMES"]
[17,234,"ANAMOSA"]
[18,243,"ANDREW"]
[19,252,"ANITA"]
[20,261,"ANKENY"]
[21,270,"ANTHON-OTO"]
[22,279,"APLINGTON-PARKERSBURG"]
[23,333,"ARMSTRONG-RINGSTED"]
[24,355,"AR-WE-VA"]
[25,387,"ATLANTIC"]
[26,414,"AUDUBON"]
[27,423,"AURELIA"]
[28,472,"BALLARD"]
[29,504,"BATTLE CREEK-IDA GROVE"]
[30,513,"BAXTER"]
[31,540,"BCLUW"]
[32,549,"BEDFORD"]
[33,7914,"BEDFORD FROM NEW MARKET"]
[34,576,"BELLE PLAINE"]
[35,585,"BELLEVUE"]
[36,594,"BELMOND-KLEMME"]
[37,603,"BENNETT"]
[38,609,"BENTON"]
[39,621,"BETTENDORF"]
[40,720,"BONDURANT-FARRAR"]
[41,729,"BOONE"]
[42,747,"BOYDEN-HULL"]
[43,1917,"BOYER VALLEY"]
[44,846,"BROOKLYN-GUERNSEY-MALCOM"]
[45,882,"BURLINGTON"]
[46,914,"C AND M"]
[47,916,"CAL"]
[48,918,"CALAMUS/WHEATLAND"]
[49,936,"CAMANCHE"]
[50,977,"CARDINAL"]
[51,981,"CARLISLE"]
[52,999,"CARROLL"]
[53,1044,"CEDAR FALLS"]
[54,1053,"CEDAR RAPIDS"]
[55,1062,"CENTER POINT-URBANA"]
[56,1071,"CENTERVILLE"]
[57,1089,"CENTRAL CITY"]
[58,1080,"CENTRAL CLAYTON"]
{"$rows_left_out":325}
{"sheet":"Data","index":2,"n_rows":384,"n_cols":43,"rows_kept":384,"cut":false,"hidden":true,"merged":[]}
[null,2,3,4,5,6,7,8,9,10,11,12,13,14,15,16,17,18,19,20,21,22,23,24,25,26,27,28,29,30,31,32,33,34,35,36,37,38,39,40,41,42,43]
[null,"Dist","School","x073 ISL Max $","x072 ISL Max Rate","x069 ISL MaxSur","x071 ISL Final Yr","x076 ED Max $","x075 Ed Max Rate","x092 Amana Max","x087 PPEL Max $","x086 PPEL Max Rate","x085 PPEL Final","x093 PERL Max","x094 Debt Max","x128 GF$ CALC","x145 GF rate","X121 ISL $","ISL rate CALC","X122 Ed $","Ed rate CALC","X129 Mgt $","X146 Mgt rate","X337 net tax val","X338 TIF  val","X130 Amana $ CALC","X147 Amana rate","X134  VPPEL $ CALC","X149 VPPEL rate","X135 RPPEL $ CALC","X150 RPPEL rate","X140 PERL $ CALC","X152 PERL rate","X141 Debt $ CALC","X153 Debt rate","X143 Total $ CALC","X155 Total rate CALC","X294 ISL sur $","X307 ISL sur rate","X296 Ed sur $","X308 Ed sur rate","X304 VPPEL sur $","X310 VPPEL sur rate"]
[1]
[2,18,"ADAIR-CASEY",0,0.1,0.2,2014,0,0,0,0,1.34,2019,0,2.7,{"$f":"ROUND(($X4/1000)*Q4,0)","v":1280667},11.248250000000001,108163,{"$f":"ROUND(R4/(X4/1000),5)","v":0.95001000000000002},0,{"$f":"ROUND(T4/(X4/1000),5)","v":0},{"$f":"ROUND(($X4/1000)*W4,0)","v":70000},0.61482000000000003,113854744,2840131,{"$f":"ROUND(($X4/1000)*AA4,0)","v":0},0,{"$f":"ROUND((($X4+$Y4)/1000)*AC4,0)","v":97734},0.83752000000000004,{"$f":"ROUND((($X4+$Y4)/1000)*AE4,0)","v":38509},0.33,{"$f":"ROUND(($X4/1000)*AG4,0)","v":0},0,{"$f":"ROUND((($X4+$Y4)/1000)*AI4,0)","v":0},0,{"$f":"P4+V4+Z4+AB4+AD4+AF4+AH4","v":1486910},{"$f":"Q4+W4+AA4+AC4+AE4+AG4+AI4","v":13.03059},58637,0.04,0,0,58637,0.04]
[3,27,"ADEL-DESOTO-MINBURN",0,0.1,0,2014,0,0,0,0,0,0,0,4.05,4785052,14.63968,594730,1.81955,0,{"$f":"ROUND(T5/(X5/1000),5)","v":0},489521,1.4976700000000001,326854985,26902683,0,0,0,0,116740,0.33,0,0,691143,1.9537199999999999,6082456,18.42107,0,0,0,0,0,0]
[4,9,"AGWSR",0,0.1,0.2,2011,0,0,0,0,1.33,2013,0,2.7,3035869,10.315390000000001,70841,0.24071000000000001,0,0,599999,2.0387,294304779,10283111,0,0,126840,0.41643000000000002,0,0,0,0,0,0,3762708,12.770520000000001,278261,0.08,0,0,278261,0.08]
[5,441,"A-H-S-T",0,0,0,0,0,0,0,0,0,0,0,2.7,2433093,11.31789,0,0,0,0,99999,0.46516000000000002,214977639,40157626,0,0,0,0,84195,0.33,0,0,430806,1.6885399999999999,3048093,13.801589999999999,0,0,0,0,0,0]
[6,63,"AKRON-WESTFIELD",0,0.1,0.2,2011,0,0,0,0,0,0,0,2.7,1839526,13.71749,14965,0.1116,0,0,179999,1.3422700000000001,134100772,8827992,0,0,0,0,47166,0.33,0,0,204104,1.42801,2270795,16.817769999999999,217950,0.09,0,0,0,0]
[7,72,"ALBERT CITY-TRUESDALE",0,0.1,0,2015,0,0,0,0,1.34,2021,0,0,1262151,11.12397,122952,1.0836399999999999,0,0,50001,0.44068000000000002,113462297,0,0,0,113462,1,37443,0.33,0,0,0,0,1463057,12.89465,0,0,0,0,0,0]
[8,81,"ALBIA",0,0.1,0.2,2012,0,0,0,0,0,0,0,2.7,3061582,14.61328,22481,0.10730000000000001,0,0,274856,1.31192,209506817,0,0,0,0,0,0,0,0,0,0,0,3336438,15.9252,415528,0.09,0,0,0,0]
[9,7918,"ALBIA FROM RUSSELL",0,0,0,0,0,0,0,0,0,0,0,0,1607,14.61328,0,0,0,0,144,1.31192,109951,0,0,0,0,0,0,0,0,0,0,0,1751,15.9252,0,0,0,0,0,0]
[10,99,"ALBURNETT",0,0.1,0,2011,0,0,0,0,0.67,2014,0,2.7,2029217,14.642749999999999,246143,1.77616,0,0,125001,0.90200000000000002,138581678,3625920,0,0,95279,0.67,46929,0.33,0,0,209832,1.47553,2506258,18.020279999999996,0,0,0,0,0,0]
[11,108,"ALDEN",0,0.1,0.2,2014,0,0,0,0,0.67,2018,0,2.7,1038988,9.3835599999999992,26560,0.23988000000000001,0,0,75000,0.67735999999999996,110724278,0,0,0,74185,0.67,36539,0.33,0,0,0,0,1224712,11.060919999999999,106162,0.1,0,0,0,0]
[12,126,"ALGONA",0,0.1,0.12,2013,0,0,0,0,0,0,0,2.7,5515584,11.43787,56227,0.1166,0,0,299999,0.62212000000000001,482221246,1749478,0,0,0,0,159710,0.33,0,0,0,0,5975293,12.389990000000001,554387,7.0000000000000007E-2,0,0,0,0]
[13,135,"ALLAMAKEE",0,0,0,0,0,0,0,0,1.1000000000000001,2013,0,2.7,4000164,11.0299,0,0,0,0,270001,0.74448999999999999,362665447,21166888,0,0,315,8.1999999999999998E-4,126665,0.33,0,0,219702,0.57238999999999995,4616847,12.6776,0,0,0,0,421900,0.08]
[14,153,"ALLISON-BRISTOW",0,0.1,7.0000000000000007E-2,2013,0,0,0,0,0.67,2016,0,2.7,1042538,11.69069,37213,0.41728999999999999,0,0,100000,1.12137,89176751,5090220,0,0,63159,0.67,31108,0.33,0,0,0,0,1236805,13.812060000000001,101182,7.0000000000000007E-2,0,0,0,0]
[15,171,"ALTA",0,0.1,0.2,2014,0,0,0,0,0,0,0,2.7,2164369,11.819699999999999,22775,0.12438,0,0,150001,0.81916,183115374,84857,0,0,0,0,60456,0.33,0,0,187430,1.0230900000000001,2562256,13.991949999999999,223238,0.09,0,0,0,0]
[16,225,"AMES",0,0.1,0.2,2011,0,0,0,0,1.34,2018,0,4.05,25014657,12.38988,198236,9.819E-2,0,0,499995,0.24765000000000001,2018958800,7370,0,0,2705415,1.34,666259,0.33,0,0,698280,0.34586,29584606,14.65339,2033447,0.05,0,0,0,0]
[17,234,"ANAMOSA",0,0.09,0.08,2014,0,0,0,0,0.67,2016,0,4.05,3490288,12.684480000000001,23221,8.4390000000000007E-2,0,0,273616,0.99438000000000004,275162080,9909328,0,0,190998,0.67,94074,0.33,0,0,0,0,4048976,14.67886,454878,7.0000000000000007E-2,0,0,0,0]
[18,243,"ANDREW",0,0.1,0.2,2016,0,0,0,0,1.34,2016,0,0,889786,12.440200000000001,495,6.9199999999999999E-3,0,0,80000,1.11849,71525062,0,0,0,24319,0.34000999999999998,23603,0.33,0,0,0,0,1017708,14.2287,128001,0.14000000000000001,0,0,0,0]
[19,252,"ANITA",0,0.1,0.2,2012,0,0,0,0,0.67,2016,0.13500000000000001,2.7,1469265,15.224539999999999,26188,0.27135999999999999,0,0,30000,0.31086000000000003,96506395,0,0,0,64659,0.67,31847,0.33,13028,0.13500000000000001,0,0,1608799,16.670400000000001,106853,0.1,0,0,0,0]
[20,261,"ANKENY",0,0.1,0,2014,0,0,0,0,1.34,2015,0,4.05,35158689,16.386970000000002,3646651,1.6996500000000001,0,0,1999996,0.93217000000000005,2145527169,169648600,0,0,3102336,1.34,764008,0.33,0,0,7771165,3.3566199999999999,48796194,22.345759999999999,0,0,0,0,0,0]
[21,270,"ANTHON-OTO",0,0.1,0.2,2012,0,0,0,0,0,0,0,2.7,1231594,14.023389999999999,68868,0.78415999999999997,0,0,0,0,87824288,0,0,0,0,0,28981,0.32999000000000001,0,0,0,0,1260575,14.35338,61635,7.0000000000000007E-2,0,0,0,0]
[22,279,"APLINGTON-PARKERSBURG",0,0.1,0.2,2011,0,0,0,0,0,0,0,2.7,2312334,11.895200000000001,88221,0.45383000000000001,0,0,250000,1.28606,194392213,16536555,0,0,0,0,69606,0.33,0,0,351150,1.6647799999999999,2983090,15.176040000000002,247574,7.0000000000000007E-2,0,0,0,0]
[23,333,"ARMSTRONG-RINGSTED",0,0.1,0.1,2012,0,0,0,0,1.34,2018,0,2.7,2138022,13.9924,43901,0.28731000000000001,0,0,140000,0.91624000000000005,152798838,7802328,0,0,135379,0.84294999999999998,52998,0.33,0,0,123815,0.77095000000000002,2590214,16.852539999999998,127724,0.08,0,0,79827,0.05]
[24,355,"AR-WE-VA",0,0.1,0.08,2011,0,0,0,0,1.34,2018,0,0,1325966,8.9962599999999995,55316,0.37530000000000002,0,0,375001,2.54426,147390818,4087753,0,0,202981,1.34,49988,0.33,0,0,0,0,1953936,13.210519999999999,115625,0.08,0,0,0,0]
[25,387,"ATLANTIC",0,0.1,0.2,2014,0,0,0,0,0.85,2012,0,2.7,4759087,13.135400000000001,16005,4.4170000000000001E-2,0,0,100001,0.27600999999999998,362309986,3468702,0,0,62288,0.17029,118015,0.32263999999999998,0,0,501896,1.3721300000000001,5541287,15.27647,604231,0.1,0,0,241692,0.04]
[26,414,"AUDUBON",0,0.1,0.2,2013,0,0,0,0,0.67,2019,0,2.7,2179078,11.59582,68092,0.36235000000000001,0,0,150001,0.79822000000000004,187919282,1033928,0,0,126599,0.67,62355,0.33,0,0,100000,0.52922999999999998,2618033,13.92327,223304,0.08,0,0,0,0]
[27,423,"AURELIA",0,0.1,0.2,2013,0,0,0,0,0.67,2020,0,0,1220750,9.2002000000000006,22898,0.17257,0,0,170000,1.28121,132687294,0,0,0,88900,0.67,43787,0.33,0,0,0,0,1523437,11.48141,123643,0.09,0,0,0,0]
[28,472,"BALLARD",0,0.1,0,2015,0,0,0,0,1.34,2017,0,4.05,3656323,16.935780000000001,476917,2.2090399999999999,0,0,314999,1.45905,215893388,71990161,0,0,245760,0.85367999999999999,95002,0.33,0,0,1165928,4.05,5478012,23.628510000000002,0,0,0,0,140004,0.02]
[29,504,"BATTLE CREEK-IDA GROVE",0,0.1,0.2,2012,0,0,0,0,0.75,2018,0,2.7,2471591,12.40241,119107,0.59767999999999999,0,0,125000,0.62724999999999997,199283134,4229760,0,0,80215,0.39415,67159,0.33,0,0,0,0,2743965,13.75381,181053,0.05,0,0,72421,0.02]
[30,513,"BAXTER",0,0.1,0.2,2011,0,0,0,0,0.67,2012,0,4.05,1087921,14.690720000000001,18253,0.24648,0,0,125000,1.68794,74054964,7339566,0,0,28241,0.34695999999999999,0,0,0,0,282140,3.4663300000000001,1523302,20.191949999999999,131463,0.1,0,0,26293,0.02]
[31,540,"BCLUW",0,0.1,0.13,2012,0,0,0,0,0,0,0.13500000000000001,2.7,2164796,10.503690000000001,17855,8.6629999999999999E-2,0,0,160001,0.77632999999999996,206098603,4449387,0,0,0,0,69481,0.33,27823,0.13500000000000001,385012,1.8286199999999999,2807113,13.573640000000001,279490,0.1,0,0,0,0]
[32,549,"BEDFORD",0,0.1,0.2,2014,0,0,0,0,0.3,2012,0,2.7,1598218,12.616910000000001,72754,0.57435000000000003,0,0,0,0,126672672,278167,0,0,20947,0.16500000000000001,41894,0.33,0,0,56709,0.44669999999999999,1717768,13.55861,166631,0.1,0,0,0,0]
[33,7914,"BEDFORD FROM NEW MARKET",0,0,0,0,0,0,0,0,0,0,0,0,290455,12.366910000000001,0,0,0,0,0,0,23486443,0,0,0,3875,0.16500000000000001,7751,0.33,0,0,10491,0.44669999999999999,312572,13.30861,0,0,0,0,0,0]
[34,576,"BELLE PLAINE",0,0.1,0.2,2014,0,0,0,0,0.6,2011,0,2.7,1849217,14.476699999999999,38131,0.29851,0,0,176500,1.38174,127737480,287500,0,0,53532,0.41814000000000001,42248,0.33,0,0,322215,2.51681,2443712,19.123389999999997,209539,0.09,0,0,23282,0.01]
[35,585,"BELLEVUE",0,0.1,0,2012,0,0,0,0,1.34,2022,0,2.7,2256106,12.866099999999999,282315,1.60998,0,0,50000,0.28514,175352733,8760229,0,0,104145,0.56566000000000005,60757,0.33,0,0,0,0,2471008,14.046899999999999,0,0,0,0,142565,0.04]
[36,594,"BELMOND-KLEMME",0,0.1,0.03,2012,0,0,0,0,0.67,2015,0,2.7,3064646,12.7197,244209,1.0135799999999999,0,0,400001,1.6601900000000001,240936953,1377214,0,0,162350,0.67,79964,0.33,0,0,266364,1.0992500000000001,3973325,16.479140000000001,102898,0.03,0,0,0,0]
[37,603,"BENNETT",0,0.1,0.1,2013,0,0,0,0,0.67,2019,0,2.7,699307,8.7231000000000005,2186,2.7269999999999999E-2,0,0,75000,0.93554000000000004,80167214,766271,0,0,54225,0.66998999999999997,26708,0.33,0,0,46915,0.57967000000000002,902155,11.238300000000001,101562,0.09,0,0,0,0]
[38,609,"BENTON",0,0.1,0.2,2012,0,0,0,0,1.34,2011,0,2.7,5450426,11.53382,341659,0.72299999999999998,0,0,310000,0.65600000000000003,472560368,24676688,0,0,100551,0.20222000000000001,164088,0.33,0,0,0,0,6025065,12.722040000000002,363169,0.04,0,0,272377,0.03]
[39,621,"BETTENDORF",0,0.1,0,2013,0,0,0,0,1.34,2014,0,2.7,15240732,12.9282,1878816,1.5937399999999999,0,0,483339,0.41,1178874986,105897526,0,0,1721595,1.34,423975,0.33,0,0,0,0,17869641,15.0082,0,0,0,0,0,0]
[40,720,"BONDURANT-FARRAR",0,0.1,0.1,2013,0,0,0,0,1.34,2018,0,4.05,3259052,14.777290000000001,287245,1.30243,0,0,99999,0.45341999999999999,220544637,23870440,0,0,327516,1.34,80657,0.33,0,0,755707,3.0918999999999999,4522931,19.992609999999999,174256,0.03,0,0,0,0]
[41,729,"BOONE",0,0.1,0.2,2015,0,0,0,0,1.34,2019,0,4.05,6816923,15.889530000000001,30472,7.1029999999999996E-2,0,0,500001,1.1654500000000001,429019784,22258562,0,0,604713,1.34,148922,0.33,0,0,67692,0.15,8138251,18.874979999999997,827635,7.0000000000000007E-2,0,0,0,0]
[42,747,"BOYDEN-HULL",0,0.1,0.2,2014,0,0,0,0,0.67,2016,0,2.7,1958759,12.975809999999999,40167,0.26608999999999999,0,0,150001,0.99368000000000001,150954627,28733982,0,0,55802,0.31054999999999999,59297,0.33,0,0,40399,0.22483,2264258,14.834869999999999,226062,7.0000000000000007E-2,0,0,64589,0.02]
[43,1917,"BOYER VALLEY",0,0.1,0.2,2013,0,0,0,0,0.63,2013,0,4.05,1560374,11.4916,13890,0.10229000000000001,0,0,90000,0.66281999999999996,135783905,1431621,0,0,86446,0.63,45281,0.33,0,0,238118,1.73536,2020219,14.849780000000001,192486,0.11,0,0,0,0]
[44,846,"BROOKLYN-GUERNSEY-MALCOM",0,0.1,0.2,2012,0,0,0,0,1.34,2020,0,3.9,1707203,9.57883,147316,0.82657000000000003,0,0,219999,1.23438,178226626,12940889,0,0,147392,0.77100999999999997,63085,0.33,0,0,341020,1.7838799999999999,2478699,13.6981,108772,0.04,0,0,108772,0.04]
[45,882,"BURLINGTON",0,0.1,0,2015,0,0,0,0,0.67,2020,0,0,12155788,15.04053,1681533,2.0805799999999999,0,0,1450003,1.7941100000000001,808202105,48912689,0,0,574267,0.67,282848,0.33,0,0,0,0,14462906,17.83464,0,0,0,0,0,0]
[46,914,"C AND M",0,0.1,0.2,2011,0,0,0,0,1.34,2020,0,2.7,1000965,12.33785,12534,0.15448999999999999,0,0,40000,0.49303999999999998,81129646,0,0,0,108714,1.34,26773,0.33,0,0,0,0,1176452,14.50089,88001,0.1,0,0,0,0]
[47,916,"CAL",0,0.1,0.2,2011,0,0,0,0,1.05,2013,0,0,1116066,9.8459900000000005,53434,0.47139999999999999,0,0,135000,1.1909799999999999,113352324,214088,0,0,74811,0.65873999999999999,37477,0.33,0,0,0,0,1363354,12.02571,88868,0.08,0,0,44434,0.04]
[48,918,"CALAMUS/WHEATLAND",0,0.1,0.2,2015,0,0,0,0,0.67,2021,0,2.7,1589103,11.79616,96859,0.71899999999999997,0,0,120000,0.89078000000000002,134713625,0,0,0,90258,0.67,0,0,0,0,172788,1.2826299999999999,1972149,14.639569999999999,126711,7.0000000000000007E-2,0,0,0,0]
[49,936,"CAMANCHE",0,0.1,0,2011,0,0,0,0,0,0,0,2.7,3429497,13.32399,423274,1.6444700000000001,0,0,250000,0.97128000000000003,257392636,369250,0,0,0,0,85061,0.33,0,0,314199,1.21895,4078757,15.84422,0,0,0,0,0,0]
[50,977,"CARDINAL",0,0.1,0.2,2015,0,0,0,0,1.34,2011,0,2.7,1686487,14.478680000000001,562,4.8199999999999996E-3,0,0,150000,1.2877700000000001,116480728,0,0,0,156084,1.34,38439,0.33,0,0,0,0,2031010,17.436450000000001,238087,0.12,0,0,0,0]
[51,981,"CARLISLE",0,0,0,0,0,0,0,0,1.34,2018,0,4.05,3826737,15.615869999999999,0,0,0,0,349999,1.42825,245054348,0,0,0,183791,0.75,80868,0.33,0,0,698603,2.8508100000000001,5139998,20.974929999999997,0,0,0,0,0,0]
[52,999,"CARROLL",0,0,0,0,0,0,0,0,0,0,0,2.7,6650213,10.75887,0,0,0,0,199997,0.32356000000000001,618114465,31889085,0,0,0,0,214501,0.33,0,0,131873,0.20288,7196584,11.615310000000001,0,0,0,0,0,0]
[53,1044,"CEDAR FALLS",0,0.1,0,2012,0,0,0,0,1.34,2018,0,0,15651695,11.922280000000001,2034416,1.54966,0,0,735003,0.55986999999999998,1312810513,235930459,0,0,2075313,1.34,511085,0.33,0,0,0,0,18973096,14.152150000000001,0,0,0,0,0,0]
[54,1053,"CEDAR RAPIDS",0,0.1,0.06,2011,0,0,0,0,0.67,2015,0,2.7,59620555,13.508380000000001,1532334,0.34717999999999999,0,0,3222853,0.73021000000000003,4413597697,163277956,0,0,3066507,0.67,1198546,0.26186999999999999,0,0,0,0,67108461,15.17046,6078039,0.05,0,0,0,0]
[55,1062,"CENTER POINT-URBANA",0,0.1,0.2,2015,0,0,0,0,0.67,2013,0,4.05,2874228,13.65841,51627,0.24532999999999999,0,0,164999,0.78408,210436468,10025742,0,0,147710,0.67,72753,0.33,0,0,688329,3.1222099999999999,3948019,18.564699999999998,401737,7.0000000000000007E-2,0,0,0,0]
[56,1071,"CENTERVILLE",0,0.02,0.03,2012,0,0,0,0,1,2011,0,2.7,3175499,14.574009999999999,2334,1.0710000000000001E-2,0,0,320001,1.46865,217887778,4779799,0,0,126005,0.56589,73480,0.33,0,0,145453,0.65322999999999998,3840438,17.591779999999996,96663,0.02,0,0,96663,0.02]
[57,1089,"CENTRAL CITY",0,0.05,0,2012,0,0,0,0,0.67,2015,0,2.7,1289507,14.25121,92651,1.0239499999999999,0,0,90000,0.99465000000000003,90484045,13539971,0,0,69696,0.67,34328,0.33,0,0,231194,2.2225100000000002,1714725,18.46837,0,0,0,0,0,0]
[58,1080,"CENTRAL CLAYTON",0,0.1,0.2,2011,0,0,0,0,0.67,2016,0,2.7,1838662,12.928750000000001,28986,0.20382,0,0,70000,0.49220999999999998,142215011,3979335,0,0,46525,0.31824000000000002,48244,0.33,0,0,0,0,2003431,14.0692,205700,0.08,0,0,51425,0.02]
{"$rows_left_out":324}